Cordova/Phonegap: get error when build a project - android

I am trying to build a android project using Phonegap. But i got this error
C:\Users\ss\Documents\Phonegap\hello1>cordova build
Running command: cmd "/s /c "C:\Users\ss\Documents\Phonegap\hello1\platforms\and
roid\cordova\build.bat""
ANDROID_HOME=C:\Program Files (x86)\Android\android-sdk
JAVA_HOME=C:\Program Files\Java\jdk1.8.0_20
Running: C:\Users\ss\Documents\Phonegap\hello1\platforms\android\gradlew cdvBuil
dDebug -b C:\Users\ss\Documents\Phonegap\hello1\platforms\android\build.gradle -
Dorg.gradle.daemon=true
FAILURE: Build failed with an exception.
* Where:
Build file 'C:\Users\ss\Documents\Phonegap\hello1\platforms\android\build.gradle
' line: 22
* What went wrong:
A problem occurred evaluating root project 'android'.
> Failed to apply plugin [id 'android']
> Could not create plugin of type 'AppPlugin'.
* Try:
Run with --stacktrace option to get the stack trace. Run with --info or --debug
option to get more log output.
BUILD FAILED
Total time: 1.708 secs
C:\Users\ss\Documents\Phonegap\hello1\platforms\android\cordova\node_modules\q\q
.js:126
throw e;
^
Error code 1 for command: cmd with args: /s /c "C:\Users\ss\Documents\Phonegap\h
ello1\platforms\android\gradlew cdvBuildDebug -b C:\Users\ss\Documents\Phonegap\
hello1\platforms\android\build.gradle -Dorg.gradle.daemon=true"
ERROR building one of the platforms: Error: cmd: Command failed with exit code 8
You may not have the required environment or OS to build this project
Error: cmd: Command failed with exit code 8
at ChildProcess.whenDone (C:\Users\ss\AppData\Roaming\npm\node_modules\cordo
va\node_modules\cordova-lib\src\cordova\superspawn.js:134:23)
at ChildProcess.emit (events.js:98:17)
at maybeClose (child_process.js:756:16)
at Process.ChildProcess._handle.onexit (child_process.js:823:5)
i am using 'cordova build' command to build android project.
please help what i missing? what should i do?

Related

Apache Cordova Execution failed for task ':compileDebugJavaWithJavac'

After some updates to Android Studio and Apache Cordova my Apache Cordova project is not building.
I am new to Apache Cordova, OS X and Android Studio.
In Android Studio when I Rebuild Project I get the following error in the Gradle console.
FAILURE: Build failed with an exception.
* What went wrong:
Execution failed for task ':compileDebugJavaWithJavac'.
> Compilation failed; see the compiler error output for details.
* Try:
Run with --stacktrace option to get the stack trace. Run with --info or --debug option to get more log output.
BUILD FAILED
In the terminal when I run the command cordova --version it prints out 4.0.0 and which javac prints out /usr/bin/javac but echo $JAVA_HOME prints nothing (an empty line).
UPDATE: I am setting the path of JAVA_HOME and ANDROID_HOME in the terminal even though I get the same errors as shown below and after closing the terminal the JAVA_HOME and ANDROID_HOME environment variables are lost, I set them as export JAVA_HOME=/Library/Java/JavaVirtualMachines/jdk1.8.0_51.jdk/Contents/Home and export ANDROID_HOME=/Users/apple/Library/Android/sdk
When I try to build the project from Cordova CLI also it is not working.
I get the following errors, where as if I create a new project after changing the distributionUrl in gradle-wrapper.properties and changing the buildToolsVersion from "19.0.0" to "19.1.0" the new project worked fine.
Please help.
cordova compile command
Sreekanth-2:19:02:16 Sreekanth$ cordova compile
Running command: "/Users/apple/Desktop/Sreekanth/Togetherly Daily Work/19:02:16/platforms/android/cordova/build"
Buildfile: /Users/apple/Desktop/Sreekanth/Togetherly Daily Work/19:02:16/platforms/android/build.xml
BUILD FAILED
/Users/apple/Desktop/Sreekanth/Togetherly Daily Work/19:/Users/apple/Desktop/Sreekanth/Togetherly Daily Work/19:02:16/platforms/android/build.xml:7: The following error occurred while executing this line:
java.io.FileNotFoundException: /Users/apple/Desktop/Sreekanth/Togetherly Daily Work/19:/usr/local/Cellar/ant/1.9.7/libexec/lib/ant.jar (No such file or directory)
at java.io.RandomAccessFile.open0(Native Method)
at java.io.RandomAccessFile.open(RandomAccessFile.java:316)
at java.io.RandomAccessFile.<init>(RandomAccessFile.java:243)
at org.apache.tools.zip.ZipFile.<init>(ZipFile.java:212)
at org.apache.tools.zip.ZipFile.<init>(ZipFile.java:177)
at org.apache.tools.ant.helper.ProjectHelper2.parse(ProjectHelper2.java:256)
at org.apache.tools.ant.helper.ProjectHelper2.parseUnknownElement(ProjectHelper2.java:131)
at org.apache.tools.ant.helper.ProjectHelper2.parseAntlibDescriptor(ProjectHelper2.java:111)
at org.apache.tools.ant.taskdefs.Antlib.createAntlib(Antlib.java:94)
at org.apache.tools.ant.taskdefs.Definer.loadAntlib(Definer.java:425)
at org.apache.tools.ant.taskdefs.Definer.execute(Definer.java:277)
at org.apache.tools.ant.ComponentHelper.checkNamespace(ComponentHelper.java:874)
at org.apache.tools.ant.ComponentHelper.getDefinition(ComponentHelper.java:307)
at org.apache.tools.ant.ComponentHelper.createComponent(ComponentHelper.java:284)
at org.apache.tools.ant.ComponentHelper.createComponent(ComponentHelper.java:263)
at org.apache.tools.ant.UnknownElement.makeObject(UnknownElement.java:430)
at org.apache.tools.ant.UnknownElement.maybeConfigure(UnknownElement.java:164)
at org.apache.tools.ant.Task.perform(Task.java:347)
at org.apache.tools.ant.Target.execute(Target.java:435)
at org.apache.tools.ant.helper.ProjectHelper2.parse(ProjectHelper2.java:180)
at org.apache.tools.ant.ProjectHelper.configureProject(ProjectHelper.java:93)
at org.apache.tools.ant.Main.runBuild(Main.java:829)
at org.apache.tools.ant.Main.startAnt(Main.java:236)
at org.apache.tools.ant.launch.Launcher.run(Launcher.java:285)
at org.apache.tools.ant.launch.Launcher.main(Launcher.java:112)
Total time: 0 seconds
/Users/apple/Desktop/Sreekanth/Togetherly Daily Work/19:02:16/platforms/android/cordova/node_modules/q/q.js:126
throw e;
^
Error code 1 for command: ant with args: debug,-f,/Users/apple/Desktop/Sreekanth/Togetherly Daily Work/19:02:16/platforms/android/build.xml,-Dout.dir=ant-build,-Dgen.absolute.dir=ant-gen
Error: /Users/apple/Desktop/Sreekanth/Togetherly Daily Work/19:02:16/platforms/android/cordova/build: Command failed with exit code 1
at ChildProcess.whenDone (/usr/local/lib/node_modules/cordova/node_modules/cordova-lib/src/cordova/superspawn.js:135:23)
at ChildProcess.emit (events.js:110:17)
at maybeClose (child_process.js:1015:16)
at Process.ChildProcess._handle.onexit (child_process.js:1087:5)
cordova build command
Sreekanth-2:19:02:16 Sreekanth$ cordova build
Running command: "/Users/apple/Desktop/Sreekanth/Togetherly Daily Work/19:02:16/platforms/android/cordova/build"
Buildfile: /Users/apple/Desktop/Sreekanth/Togetherly Daily Work/19:02:16/platforms/android/build.xml
BUILD FAILED
/Users/apple/Desktop/Sreekanth/Togetherly Daily Work/19:/Users/apple/Desktop/Sreekanth/Togetherly Daily Work/19:02:16/platforms/android/build.xml:7: The following error occurred while executing this line:
java.io.FileNotFoundException: /Users/apple/Desktop/Sreekanth/Togetherly Daily Work/19:/usr/local/Cellar/ant/1.9.7/libexec/lib/ant.jar (No such file or directory)
at java.io.RandomAccessFile.open0(Native Method)
at java.io.RandomAccessFile.open(RandomAccessFile.java:316)
at java.io.RandomAccessFile.<init>(RandomAccessFile.java:243)
at org.apache.tools.zip.ZipFile.<init>(ZipFile.java:212)
at org.apache.tools.zip.ZipFile.<init>(ZipFile.java:177)
at org.apache.tools.ant.helper.ProjectHelper2.parse(ProjectHelper2.java:256)
at org.apache.tools.ant.helper.ProjectHelper2.parseUnknownElement(ProjectHelper2.java:131)
at org.apache.tools.ant.helper.ProjectHelper2.parseAntlibDescriptor(ProjectHelper2.java:111)
at org.apache.tools.ant.taskdefs.Antlib.createAntlib(Antlib.java:94)
at org.apache.tools.ant.taskdefs.Definer.loadAntlib(Definer.java:425)
at org.apache.tools.ant.taskdefs.Definer.execute(Definer.java:277)
at org.apache.tools.ant.ComponentHelper.checkNamespace(ComponentHelper.java:874)
at org.apache.tools.ant.ComponentHelper.getDefinition(ComponentHelper.java:307)
at org.apache.tools.ant.ComponentHelper.createComponent(ComponentHelper.java:284)
at org.apache.tools.ant.ComponentHelper.createComponent(ComponentHelper.java:263)
at org.apache.tools.ant.UnknownElement.makeObject(UnknownElement.java:430)
at org.apache.tools.ant.UnknownElement.maybeConfigure(UnknownElement.java:164)
at org.apache.tools.ant.Task.perform(Task.java:347)
at org.apache.tools.ant.Target.execute(Target.java:435)
at org.apache.tools.ant.helper.ProjectHelper2.parse(ProjectHelper2.java:180)
at org.apache.tools.ant.ProjectHelper.configureProject(ProjectHelper.java:93)
at org.apache.tools.ant.Main.runBuild(Main.java:829)
at org.apache.tools.ant.Main.startAnt(Main.java:236)
at org.apache.tools.ant.launch.Launcher.run(Launcher.java:285)
at org.apache.tools.ant.launch.Launcher.main(Launcher.java:112)
Total time: 0 seconds
/Users/apple/Desktop/Sreekanth/Togetherly Daily Work/19:02:16/platforms/android/cordova/node_modules/q/q.js:126
throw e;
^
Error code 1 for command: ant with args: debug,-f,/Users/apple/Desktop/Sreekanth/Togetherly Daily Work/19:02:16/platforms/android/build.xml,-Dout.dir=ant-build,-Dgen.absolute.dir=ant-gen
Error: /Users/apple/Desktop/Sreekanth/Togetherly Daily Work/19:02:16/platforms/android/cordova/build: Command failed with exit code 1
at ChildProcess.whenDone (/usr/local/lib/node_modules/cordova/node_modules/cordova-lib/src/cordova/superspawn.js:135:23)
at ChildProcess.emit (events.js:110:17)
at maybeClose (child_process.js:1015:16)
at Process.ChildProcess._handle.onexit (child_process.js:1087:5)
Sreekanth-2:19:02:16 Sreekanth$
Go to Project.Properties
add the following lines
cordova.system.library.1=com.google.android.gms:play-services-auth:9.8.0
cordova.system.library.2=com.google.android.gms:play-services-identity:9.8.0
run the cordova commands again, You can able to build a release and debug builds
Type the following in your terminal
echo "export JAVA_HOME=/usr/libexec/java_home"
This will print the exact export for Java_home , copy that and paste it in terminal and press enter.
Then try echo $java_home.

Execution failed for task ':packageDebug' - ionic framework

It was working properly.. But suddenly when I tried to run ionic build android, I got this error. I am not able to find out the issue.
FAILURE: Build failed with an exception.
* What went wrong:
Execution failed for task ':packageDebug'.
> Failed to add C:\git\personal\amarEla-app\platforms\android\build\intermediate
s\exploded-aar\android\CordovaLib\unspecified\debug\classes.jar
* Try:
Run with --stacktrace option to get the stack trace. Run with --info or --debug
option to get more log output.
BUILD FAILED
Total time: 6.603 secs
c:\git\personal\amarEla-app\platforms\android\cordova\node_modules\q\q.js:126
throw e;
^
Error code 1 for command: cmd with args: /s /c "c:\git\personal\amarEla-app\plat
forms\android\gradlew cdvBuildDebug -b c:\git\personal\amarEla-app\platforms\and
roid\build.gradle -Dorg.gradle.daemon=true"
ERROR building one of the platforms: Error: cmd: Command failed with exit code 8
You may not have the required environment or OS to build this project
Error: cmd: Command failed with exit code 8
at ChildProcess.whenDone (c:\Users\amitsinha02\AppData\Roaming\npm\node_modu
les\cordova\node_modules\cordova-lib\src\cordova\superspawn.js:134:23)
at ChildProcess.emit (events.js:98:17)
at maybeClose (child_process.js:766:16)
at Process.ChildProcess._handle.onexit (child_process.js:833:5)
Any suggestions?

Cordova Android Build Exception

I am getting this error when trying to build a project created using Cordova CLI. I have added the android platform to the project.
D:\MHIS_Phonegap\MHIS>cordova build --info android
Running command: cmd "/s /c "D:\MHIS_Phonegap\MHIS\platforms\android\cordova\build.bat""
ANDROID_HOME=E:\adt-bundle-windows-x86_64-20130522\sdk
JAVA_HOME=C:\Program Files\Java\jdk1.7.0_21
Running: D:\MHIS_Phonegap\MHIS\platforms\android\gradlew cdvBuildDebug -b D:\MHIS_Phonegap\MHIS\platforms\android\build.gradle -Dorg.gradle.daemon=true
FAILURE: Build failed with an exception.
* What went wrong:
A problem occurred configuring root project 'android'.
> Could not resolve all dependencies for configuration ':classpath'.
> Could not resolve com.android.tools.build:gradle:1.0.0+.
Required by:
:android:unspecified
> Failed to list versions for com.android.tools.build:gradle.
> Unable to load Maven meta-data from https://repo1.maven.org/maven2/com/android/tools/build/gradle/maven-metadata.xml.
> Could not GET 'https://repo1.maven.org/maven2/com/android/tools/build/gradle/maven-metadata.xml'.
> peer not authenticated
* Try:
Run with --stacktrace option to get the stack trace. Run with --info or --debug option to get more log output.
BUILD FAILED
Total time: 11.562 secs
D:\MHIS_Phonegap\MHIS\platforms\android\cordova\node_modules\q\q.js:126
throw e;
^
Error code 1 for command: cmd with args: /s /c "D:\MHIS_Phonegap\MHIS\platforms\android\gradlew cdvBuildDebug -b D:\MHIS_Phonegap\MHIS\platforms\android\build.gradle -Dorg.gradle.daemon=true"
ERROR building one of the platforms: Error: cmd: Command failed with exit code 1
You may not have the required environment or OS to build this project
Error: cmd: Command failed with exit code 1
at ChildProcess.whenDone (C:\Users\lenovo\AppData\Roaming\npm\node_modules\cordova\node_modules\cordova-lib\src\cordova\superspawn.js:134:23)
at ChildProcess.emit (events.js:110:17)
at maybeClose (child_process.js:1015:16)
at Process.ChildProcess._handle.onexit (child_process.js:1087:5)
Any help on what is the cause and how to resolve?

Cordova Android Build Failure

I am trying to get the basic Cordova v5.0 Android v4.0 project to build on Mac OS X Yosemite, but keep getting this error. Note: The same process builds fine on Cordova v4. I have uninstalled and reinstalled the Android SDK, Cordova, and even Gradle (but I don't think I need it). I've checked that my Path variable contains the correct paths to /tools and /platform_tools. But when I do the 'cordova build' or 'cordova build android' I always get the same error:
Could not create an instance of type
org.gradle.invocation.DefaultGradle_Decorated.
Further down it says:
You may not have the required environment or OS to build this project
What am I missing?
Here's the full text of what I'm doing:
my_acct$cordova create build_test com.example.build_test "BuildTest"
Creating a new cordova project.
my_acct$cd build_test
my_acct$cordova platform add android
Adding android project...
Creating Cordova project for the Android platform:
Path: platforms/android
Package: com.example.build_test
Name: BuildTest
Activity: MainActivity
Android target: android-22
Copying template files...
Android project created with cordova-android#4.0.0
Discovered plugin "cordova-plugin-whitelist" in config.xml. Installing to the project
Fetching plugin "cordova-plugin-whitelist#1" via npm
npm http GET https://registry.npmjs.org/cordova-plugin-whitelist
npm http GET https://registry.npmjs.org/cordova-plugin-whitelist
npm http 304 https://registry.npmjs.org/cordova-plugin-whitelist
Installing "cordova-plugin-whitelist" for android
my_acct$cordova build
Running command: /Users/my_acct/Documents/Development/work/build_test/platforms/android/cordova/build
ANDROID_HOME=/Users/my_acct/Documents/Development/android-sdk-macosx/sdk
JAVA_HOME=/System/Library/Java/JavaVirtualMachines/1.6.0.jdk/Contents/Home
Running: /Users/my_acct/Documents/Development/work/build_test/platforms/android/gradlew cdvBuildDebug -b /Users/my_acct/Documents/Development/work/build_test/platforms/android/build.gradle -Dorg.gradle.daemon=true
FAILURE: Build failed with an exception.
* What went wrong:
Could not create an instance of type org.gradle.invocation.DefaultGradle_Decorated.
* Try:
Run with --stacktrace option to get the stack trace. Run with --info or --debug option to get more log output.
/Users/my_acct/Documents/Development/work/build_test/platforms/android/cordova/node_modules/q/q.js:126
throw e;
^
Error code 1 for command: /Users/my_acct/Documents/Development/work/build_test/platforms/android/gradlew with args: cdvBuildDebug,-b,/Users/my_acct/Documents/Development/work/build_test/platforms/android/build.gradle,-Dorg.gradle.daemon=true
ERROR building one of the platforms: Error: /Users/my_acct/Documents/Development/work/build_test/platforms/android/cordova/build: Command failed with exit code 8
You may not have the required environment or OS to build this project
Error: /Users/my_acct/Documents/Development/work/build_test/platforms/android/cordova/build: Command failed with exit code 8
at ChildProcess.whenDone (/Users/my_acct/.node/lib/node_modules/cordova/node_modules/cordova-lib/src/cordova/superspawn.js:131:23)
at ChildProcess.emit (events.js:98:17)
at maybeClose (child_process.js:766:16)
at Process.ChildProcess._handle.onexit (child_process.js:833:5)
If I change to use java 1.7 or 1.8, the error changes to:
A problem occurred configuring root project 'android'.
Could not resolve all dependencies for configuration ':classpath'.
Could not resolve com.android.tools.build:gradle:1.0.0+.
Required by:
:android:unspecified
org.slf4j.spi.LocationAwareLogger.log(Lorg/slf4j/Marker;Ljava/lang/String;ILjava/lang/String;[Ljava/lang/Object;Ljava/lang/Throwable;)V
Here's the full results for using java 1.7 or 1.8:
my_acct$cordova build
Running command: /Users/my_acct/Documents/Development/work/build_test/platforms/android/cordova/build
ANDROID_HOME=/Users/my_acct/Documents/Development/android-sdk-macosx/sdk
JAVA_HOME=/Library/Java/JavaVirtualMachines/jdk1.7.0_79.jdk/Contents/Home
Running: /Users/my_acct/Documents/Development/work/build_test/platforms/android/gradlew cdvBuildDebug -b /Users/my_acct/Documents/Development/work/build_test/platforms/android/build.gradle -Dorg.gradle.daemon=true
FAILURE: Build failed with an exception.
* What went wrong:
A problem occurred configuring root project 'android'.
> Could not resolve all dependencies for configuration ':classpath'.
> Could not resolve com.android.tools.build:gradle:1.0.0+.
Required by:
:android:unspecified
> org.slf4j.spi.LocationAwareLogger.log(Lorg/slf4j/Marker;Ljava/lang/String;ILjava/lang/String;[Ljava/lang/Object;Ljava/lang/Throwable;)V
* Try:
Run with --stacktrace option to get the stack trace. Run with --info or --debug option to get more log output.
BUILD FAILED
Total time: 4.859 secs
/Users/my_acct/Documents/Development/work/build_test/platforms/android/cordova/node_modules/q/q.js:126
throw e;
^
Error code 1 for command: /Users/my_acct/Documents/Development/work/build_test/platforms/android/gradlew with args: cdvBuildDebug,-b,/Users/my_acct/Documents/Development/work/build_test/platforms/android/build.gradle,-Dorg.gradle.daemon=true
ERROR building one of the platforms: Error: /Users/my_acct/Documents/Development/work/build_test/platforms/android/cordova/build: Command failed with exit code 8
You may not have the required environment or OS to build this project
Error: /Users/my_acct/Documents/Development/work/build_test/platforms/android/cordova/build: Command failed with exit code 8
at ChildProcess.whenDone (/Users/my_acct/.node/lib/node_modules/cordova/node_modules/cordova-lib/src/cordova/superspawn.js:131:23)
at ChildProcess.emit (events.js:98:17)
at maybeClose (child_process.js:766:16)
at Process.ChildProcess._handle.onexit (child_process.js:833:5)
I figured it out. I found old, conflicting .jar files in ~/Library/Java/Extensions. Blew away the entire ~/Library/Java directory. Cordova (and Android Studio) runs great now.
The other way how this problem can be resolved is by changing the repository from
mavenCentral()
to
maven{
url 'https://repo1.maven.org/maven2'
}
in both platforms/android/build.gradle and platforms/android/CordovaLib/build.gradle

CCA Emulate Android error

I'm making an android app in the Chrome API. I got my emulator set up and everything seems to be working fine except CCA throws a weird error.
C:\Users\Giovanni\Google Drive\cde\dwm\DerpyWorld>cca emulate android
cca v0.5.0
Running command: "C:\Program Files\nodejs\node.exe" "C:\Users\Giovanni\Google Drive\cde\dwm\DerpyWorld\hooks\before_prep are\cca-check.js" "C:\Users\Giovanni\Google Drive\cde\dwm\DerpyWorld"
Running command: cmd "/s /c ""C:\Users\Giovanni\Google Drive\cde\dwm\DerpyWorld\platforms\android\cordova\run.bat" --emulator""
'C:\Users\Giovanni\Google' is not recognized as an internal or external command,
operable program or batch file.
C:\Users\Giovanni\Google Drive\cde\dwm\DerpyWorld\platforms\android\cordova\node_modules\q\q.js:126
throw e;
^
Error code 1 for command: cmd with args: /s,/c,C:\Users\Giovanni\Google Drive\cde\dwm\DerpyWorld\platforms\android\gradl
ew,assembleX86Debug,-b,C:\Users\Giovanni\Google Drive\cde\dwm\DerpyWorld\platforms\android\build.gradle,-Dorg.gradle.dae
mon=true,-x,lint,-x,lintVitalX86Release,-x,lintVitalArmv7Release,-x,compileLint,-x,copyReleaseLint,-x,copyDebugLint
Error: cmd: Command failed with exit code 8
at ChildProcess.whenDone (C:\Users\Giovanni\AppData\Roaming\npm\node_modules\cca\node_modules\cordova\node_modules\c
ordova-lib\src\cordova\superspawn.js:135:23)
at ChildProcess.emit (events.js:98:17)
at maybeClose (child_process.js:756:16)
at Process.ChildProcess._handle.onexit (child_process.js:823:5)
C:\Users\Giovanni\Google Drive\cde\dwm\DerpyWorld>
Any ideas?
Oke, well I fixed the last issue by moving it into a folder with no spaces... a really bad fix imo. Of course, issues continue.
C:\Users\Giovanni\android\DerpyWorld>cca emulate android
cca v0.5.0
Running command: "C:\Program Files\nodejs\node.exe" C:\Users\Giovanni\android\DerpyWorld\hooks\before_prepare\cca-check.js C:\Users\Giovanni\android\DerpyWorld
Running command: C:\Users\Giovanni\android\DerpyWorld\platforms\android\cordova\run.bat --emulator
FAILURE: Build failed with an exception.
Where:
Build file 'C:\Users\Giovanni\android\DerpyWorld\platforms\android\build.gradle' line: 27
What went wrong:
A problem occurred evaluating root project 'android'.
Failed to apply plugin [id 'android']
Gradle version 1.10 is required. Current version is 2.2.1. If using the gradle wrapper, try editing the distributionUrl in C:\Users\Giovanni\android\DerpyWorld\gradle\wrapper\gradle-wrapper.properties to gradle-1.10-all.zip
Try:
Run with --stacktrace option to get the stack trace. Run with --info or --debug option to get more log output.
BUILD FAILED
Total time: 1.178 secs
C:\Users\Giovanni\android\DerpyWorld\platforms\android\cordova\node_modules\q\q.js:126
throw e;
^
Error code 1 for command: cmd with args: /s,/c,C:\Users\Giovanni\android\DerpyWorld\platforms\android\gradlew,assembleX86Debug,-b,C:\Users\Giovanni\android\DerpyWorld\platforms\android\build.gradle,-Dorg.gradle.daemon=true,-x,lint,-x,lintVitalX86Release,-x,lintVitalArmv7
Release,-x,compileLint,-x,copyReleaseLint,-x,copyDebugLint
Error: C:\Users\Giovanni\android\DerpyWorld\platforms\android\cordova\run.bat: Command failed with exit code 8
at ChildProcess.whenDone (C:\Users\Giovanni\AppData\Roaming\npm\node_modules\cca\node_modules\cordova\node_modules\cordova-lib\src\cordova\superspawn.js:135:23)
at ChildProcess.emit (events.js:98:17)
at maybeClose (child_process.js:756:16)
at Process.ChildProcess._handle.onexit (child_process.js:823:5)
C:\Users\Giovanni\android\DerpyWorld>C:\Users\Giovanni\android\DerpyWorld\gradle\wrapper\gradle-wrapper.properties to gradle-1.10-all.zip
The problem is with this line:
cmd "/s /c ""C:\Users\Giovanni\Google Drive\cde\dwm\DerpyWorld\platforms\android\cordova\run.bat" --emulator""
The path is not passed properly as a parameter, and the parse is not reading past the in the path.
There is a setting somewhere in CCA that determines the value of this line, and it is incorrect. You need to double-check your ""s in that string, as they are causing your error.

Categories

Resources