Dex file exceeded 64k after adding Google Play Services 9.0.0 - android

I was following the Firebase guide to adding FCM, and so I added the following dependencies to my app gradle:
compile 'com.google.android.gms:play-services:9.0.0'
apply plugin: 'com.google.gms.google-services'
And this one to my project gradle:
classpath 'com.google.gms:google-services:3.0.0'
After this, I added the google-services.json from the Firebase console settings by downloading it and adding it to my app directory.
Now I'm getting this error:
Error:The number of method references in a .dex file cannot exceed 64K.
Learn how to resolve this issue at https://developer.android.com/tools/building/multidex.html
If I follow the instructions and have my application to support multidex, my application crashes as soon as it launches.
Here is the error after adding multidex to my app:
05-20 01:25:32.253 19812-19812/com.cryogenos.pearsonvisionlimousine W/dalvikvm: VFY: unable to resolve static field 8723 (common_google_play_services_unknown_issue) in Lcom/google/android/gms/R$string;05-20 01:25:32.253 19812-19812/com.cryogenos.pearsonvisionlimousine W/dalvikvm: threadid=1: thread exiting with uncaught exception (group=0x416b5e30)05-20 01:25:32.253 19812-19812/com.cryogenos.pearsonvisionlimousine E/AndroidRuntime: FATAL EXCEPTION: mainProcess: com.cryogenos.pearsonvisionlimousine, PID: 19812java.lang.NoClassDefFoundError: com.google.android.gms.R$stringat com.google.android.gms.common.internal.zzah.<init>
(Unknown Source)
at com.google.firebase.FirebaseOptions.fromResource(Unknown Source)
at com.google.firebase.FirebaseApp.zzbu(Unknown Source)
at com.google.firebase.provider.FirebaseInitProvider.onCreate(Unknown Source)
at android.content.ContentProvider.attachInfo(ContentProvider.java:1609)
at android.content.ContentProvider.attachInfo(ContentProvider.java:1574)
at com.google.firebase.provider.FirebaseInitProvider.attachInfo(Unknown Source)
at android.app.ActivityThread.installProvider(ActivityThread.java:5643)
at android.app.ActivityThread.installContentProviders(ActivityThread.java:5206)
at android.app.ActivityThread.handleBindApplication(ActivityThread.java:5143)
at android.app.ActivityThread.access$1500(ActivityThread.java:156)
at android.app.ActivityThread$H.handleMessage(ActivityThread.java:1418)
at android.os.Handler.dispatchMessage(Handler.java:102)
at android.os.Looper.loop(Looper.java:157)
at android.app.ActivityThread.main(ActivityThread.java:5883)
at java.lang.reflect.Method.invokeNative(Native Method)
at java.lang.reflect.Method.invoke(Method.java:515)
at com.android.internal.os.ZygoteInit$MethodAndArgsCaller.run(ZygoteInit.java:872)
at com.android.internal.os.ZygoteInit.main(ZygoteInit.java:688)
at dalvik.system.NativeStart.main(Native Method)
My phone's google play services is 9.0.0+.
I have updated to the latest play services and the repository in SDK manager.
EDIT:
My app build.gradle:
apply plugin: 'com.android.application'
android {
compileSdkVersion 23
buildToolsVersion "22.0.1"
defaultConfig {
applicationId "com.cryogenos.pearsonvisionlimousine"
minSdkVersion 19
targetSdkVersion 23
versionCode 3
versionName "2.1"
multiDexEnabled true
}
buildTypes {
release {
minifyEnabled true
proguardFiles getDefaultProguardFile('proguard-android.txt'), 'proguard-rules.pro'
}
}
}
dependencies {
compile fileTree(dir: 'libs', include: ['*.jar'])
testCompile 'junit:junit:4.12'
compile 'com.android.support:appcompat-v7:23.1.1'
compile 'com.google.android.gms:play-services:9.0.0'
compile 'com.mcxiaoke.volley:library:1.0.19'
compile 'com.android.support:design:23.1.1'
compile 'com.android.support:multidex:1.0.0'
compile 'com.google.firebase:firebase-messaging:9.0.0'
}
apply plugin: 'com.google.gms.google-services'

One possible way to avoid 64k Dex error is by including only those APIs which your app needs from Google Play Services.
Selectively compiling APIs into your executable
From version 6.5, you can instead selectively compile Google Play service APIs into your app. For example, to include only the Google Fit and Android Wear APIs, replace the following line in your build.gradle file:
compile 'com.google.android.gms:play-services:9.0.0'
with these lines:
compile 'com.google.android.gms:play-services-fitness:9.0.0'
compile 'com.google.android.gms:play-services-wearable:9.0.0'
UPDATED
Well I read the doc, which says
Apps that rely on the Play Services SDK should always check the device for a compatible Google Play services APK before accessing Google Play services features
So you only need to check Google Play Service is available or not. And to do this you only need Google Actions, Base Client Library API.
compile 'com.google.android.gms:play-services-base:9.0.0'

as explained in documentation use Selectively compiling APIs into your executable which is best approach for you(take it in first priority insted of Multi Dex), because Multi-dex have some limitations check before proceed.
Avoiding the 64K Limit - Proguard will help you
Before configuring your app to enable use of 64K or more method
references, you should take steps to reduce the total number of
references called by your app code, including methods defined by your
app code or included libraries. The following strategies can help you
avoid hitting the dex reference limit:
Review your app's direct and transitive dependencies - Ensure any large library dependency you include in your app is used in a manner
that outweighs the amount of code being added to the application. A
common anti-pattern is to include a very large library because a few
utility methods were useful. Reducing your app code dependencies can
often help you avoid the dex reference limit.
Remove unused code with ProGuard - Configure the ProGuard settings for your app to run ProGuard and ensure you have shrinking enabled for
release builds. Enabling shrinking ensures you are not shipping unused
code with your APKs.
Using these techniques can help you avoid the
build configuration changes required to enable more method references
in your app. These steps can also decrease the size of your APKs,
which is particularly important for markets where bandwidth costs are
high.
So, try to avoid Multi-Dex
one more thing when you use compile 'com.android.support:design:23.1.1' then you not need to use compile 'com.android.support:appcompat-v7:23.1.1' and compile 'com.android.support:support-v4:23.1.1'. so remove v7 & v4 from build.gradle file

First check if the multidex has really worked, you can do that by renaming the apk file to zip and extracting it. There should 2 multiple classes.dex files.
Secondly, it can also happen if earlier to reduce the method you must have used proguard, so just comment the use of proguard and it should work.
Otherwise paste your exception here.

Something wrong.
Checking the doc you only need this dependency
dependencies {
compile 'com.google.firebase:firebase-messaging:9.0.0'
}
So you can remove this dependency
//compile 'com.google.android.gms:play-services:9.0.0'
If it is not enough and you have more than 65536 methods you can use the multidex support.
Just add these lines in the build.gradle:
android {
defaultConfig {
...
// Enabling multidex support.
multiDexEnabled true
}
...
}
dependencies {
compile 'com.android.support:multidex:1.0.0'
}
Also in your Manifest add the MultiDexApplication class from the multidex support library to the application element
<?xml version="1.0" encoding="utf-8"?>
<manifest xmlns:android="http://schemas.android.com/apk/res/android"
package="com.example.android.multidex.myapplication">
<application
...
android:name="android.support.multidex.MultiDexApplication">
...
</application>
</manifest>
and override attachBaseContext method:
#Override
protected void attachBaseContext(Context newBase) {
super.attachBaseContext(newBase);
MultiDex.install(this);
}
If you are using a own Application class, change the parent class from Application to MultiDexApplication.

Related

Android 4.X : NoClassDefFoundError: io/reactivex/Observable [duplicate]

I have a project in which I have enabled multidex to avoid 65k limit and also productFlavors (dev API 21 and prod API 19) for customization.
Building my Project on API 21 i.e dev flavor is successful but on API 19 i.e. prod flavor, it is continuously giving me exception in app task shrink{component}MultiDexComponents
Complete Error log:
:app:shrinkProdDebugMultiDexComponents FAILED
FAILURE: Build failed with an exception.
* What went wrong:
Execution failed for task ':app:shrinkProdDebugMultiDexComponents'.
> java.io.IOException: Can't read [{Project Path}/app/build/intermediates/multi-dex/prod/debug/allclasses.jar] (Can't process class [com/olivephone/office/a/b/e/p.class] (Unknown verification type [17] in stack map frame))
build.gradle
apply plugin: 'com.android.application'
android {
compileSdkVersion 23
buildToolsVersion '23.0.0'
defaultConfig {
applicationId '{Project Name}'
minSdkVersion 15
targetSdkVersion 23
versionCode 1
versionName "1.0"
multiDexEnabled true
}
productFlavors {
dev {
// dev utilizes minSDKVersion = 21 to allow the Android gradle plugin
// to pre-dex each module and produce an APK that can be tested on
// Android Lollipop without time consuming dex merging processes.
minSdkVersion 21
}
prod {
// The actual minSdkVersion for the application.
minSdkVersion 19
}
}
buildTypes {
release {
minifyEnabled false
proguardFiles getDefaultProguardFile('proguard-android.txt'), 'proguard-rules.pro'
}
}
}
dependencies {
compile fileTree(include: ['*.jar'], dir: 'libs')
compile 'com.android.support:appcompat-v7:23.0.1'
compile 'com.android.support:recyclerview-v7:23.0.1'
compile 'com.android.support:cardview-v7:23.0.1'
compile 'com.oguzdev:CircularFloatingActionMenu:1.0.2'
compile 'com.google.code.gson:gson:2.3.1'
compile 'com.google.android.gms:play-services:8.1.0'
compile 'com.android.support:multidex:1.0.1'
compile files('libs/linkedin-j-android.jar')
compile files('libs/itsrts-pptviewer.jar')
compile files('libs/signpost-core-1.2.1.1.jar')
compile 'org.twitter4j:twitter4j-core:4.0.2'
compile files('libs/universal-image-loader-1.9.2-SNAPSHOT-with-sources.jar')
compile files('libs/dropbox-android-sdk-1.6.3.jar')
compile files('libs/json_simple-1.1.jar')
compile 'com.joanzapata.pdfview:android-pdfview:1.0.1#jar'
compile 'com.facebook.android:facebook-android-sdk:4.1.0'
}
Any help please anyone ??
Multidex support for Android 5.0 and higher
Android 5.0 and higher uses a runtime called ART which natively
supports loading multiple dex files from application APK files. ART
performs pre-compilation at application install time which scans for
classes(..N).dex files and compiles them into a single .oat file for
execution by the Android device. For more information on the Android
5.0 runtime, see Introducing ART.
This is the reason why your app is working fine on API level 21.
Multidex support prior to Android 5.0
Versions of the platform prior to Android 5.0 use the Dalvik runtime
for executing app code. By default, Dalvik limits apps to a single
classes.dex bytecode file per APK. In order to get around this
limitation, you can use the multidex support library, which becomes
part of the primary DEX file of your app and then manages access to
the additional DEX files and the code they contain.
So, Firstly making sure you have imported correct dependency, which It seems you did it.
dependencies {
compile 'com.android.support:multidex:1.0.0'
}
In your manifest add the MultiDexApplication class from the multidex support library to the application element.
<?xml version="1.0" encoding="utf-8"?>
<manifest xmlns:android="http://schemas.android.com/apk/res/android"
package="com.example.android.multidex.myapplication">
<application
...
android:name="android.support.multidex.MultiDexApplication">
...
</application>
</manifest>
Alternative to that, If your app extends the Application class, you can override the attachBaseContext() method and call MultiDex.install(this) to enable multidex.
public void onCreate(Bundle arguments) {
MultiDex.install(getTargetContext());
super.onCreate(arguments);
...
}
I hope it will help you out.
In API 21, :app:shrinkProdDebugMultiDexComponents command is not called as API 21 already uses ART instead of Dalvik. Thus, natively support multidex.
For API below 21, then the command :app:shrinkProdDebugMultiDexComponents is executed.
Checking your build.gradle everything looks fine, which brings me to the following.
Have you setup multidex support properly?
Have you setup your manifest to support Multidex?
<?xml version="1.0" encoding="utf-8"?>
<manifest xmlns:android="http://schemas.android.com/apk/res/android"
package="com.example.android.multidex.myapplication">
<application
...
android:name="android.support.multidex.MultiDexApplication">
...
</application>
</manifest>
OR if you actually extending the application class, you can do this:
public class MyApplication extends Application {
...
#Override
protected void attachBaseContext(Context base) {
super.attachBaseContext(base);
MultiDex.install(this);
}
...
}
or use this "pre-built" version
public class MyApplication extends MultiDexApplication{
...
}
I haven't peeped into the logic behind this, but in my case, it was due to version conflicts of compile 'com.android.support:appcompat-v7:25.3.1' and compile 'com.google.android.gms:play-services:10.2.4' in my build.gradle file.
Only enabling multidex didn't work for me. While searching for the other solutions, I found some people complaining about wierd issue of version conflict of play-services. So, I backtracked the code changes and finally changed play-services version from 10.2.4 to 10.2.1 and it worked for me.
Solved above crash issue. I have remove some unused dependency and also removed rx java dependency io.reactivex.rxjava . In replacement of Rx java i have added some dummy classes in my package which is already described here https://realm.io/docs/java/latest.
// File 1
package io.reactivex;
public class Flowable {
}
// File 2
package io.reactivex;
public class Observable {
}
// File 3
package io.reactivex;
public enum BackpressureStrategy {
LATEST;
}
Please change your dependencies as below :
Edited dependencies:
compile fileTree(dir: 'libs', include: ['*.jar'])
compile 'com.android.support:appcompat-v7:23.0.1'
compile 'com.android.support:recyclerview-v7:23.0.1'
compile 'com.android.support:cardview-v7:23.0.1'
compile 'com.oguzdev:CircularFloatingActionMenu:1.0.2'
compile 'com.google.code.gson:gson:2.3.1'
compile 'com.google.android.gms:play-services:8.1.0'
compile 'com.android.support:multidex:1.0.1'
compile 'com.googlecode.linkedin-j:linkedin-j-core:1.0.416'
compile 'oauth.signpost:signpost-core:1.2.1.2'
compile 'com.nostra13.universalimageloader:universal-image-loader:1.9.4'
compile 'com.googlecode.json-simple:json-simple:1.1'
compile 'org.twitter4j:twitter4j-core:4.0.2'
compile files('libs/itsrts-pptviewer.jar')
compile files('libs/dropbox-android-sdk-1.6.3.jar')
compile 'com.joanzapata.pdfview:android-pdfview:1.0.1#jar'
compile 'com.facebook.android:facebook-android-sdk:4.1.0'
Reason is that 'compile fileTree(dir: 'libs', include: ['*.jar'])' includes all jar file to gradle that is in libs folder..
Thanks.!!
The shrinkProdDebugMultiDexComponents task invokes Proguard, so this error comes from Proguard code.
My guess will be that you're not using the latest version of Olive Office SDK (which is probably obfuscated with buggy or misconfigured Proguard version). If this is the case, get the latest version from SDK developer.
For workaround, check this similar bug. Although it was closed with wontfix status, this blogpost describes how to patch the Proguard code.
Also check this and that answers by Eric Lafortune (Proguard's author) on similar issues.

Build Failed when i try to run the app

I have the error like
"Error:Execution failed for task ':app:transformClassesWithJarMergingForDebug'.
com.android.build.api.transform.TransformException: java.util.zip.ZipException: duplicate entry: com/google/android/gms/internal/zzpm$zza$zza.class"
What should i do to remove this error
gradle
apply plugin: 'com.android.application'
android {
compileSdkVersion 23
buildToolsVersion "23.0.2"
defaultConfig {
applicationId "com.example.user.merchant"
minSdkVersion 15
targetSdkVersion 23
versionCode 1
versionName "1.0"
multiDexEnabled true
}
buildTypes {
release {
minifyEnabled false
proguardFiles getDefaultProguardFile('proguard-android.txt'), 'proguard-rules.pro'
}
}
}
dependencies {
compile fileTree(include: ['*.jar'], dir: 'libs')
testCompile 'junit:junit:4.12'
compile 'com.android.support:appcompat-v7:23.2.0'
compile 'com.android.support:design:23.2.0'
compile 'com.android.support:support-v4:23.2.0'
compile 'com.android.volley:volley:1.0.0'
compile 'com.google.android.gms:play-services-appindexing:8.4.0'
compile 'com.google.android.gms:play-services-gcm:8.4.0'
//compile files('libs/google-play-services.jar')
}
As #Vaiden says the issue was:
"It seems that you have at least one library already bundled with GMS"
Every time that you face a duplicate entry error run ./gradlew app:dependencies and make sure that there is no duplicated versions of a same module. For example: in my case I had:
compile 'com.google.android.gms:play-services-gcm:9.0.0'
When I tried to use firebase in my project I add it like:
compile 'com.google.firebase:firebase-core:9.+'
compile 'com.google.firebase:firebase-messaging:9.+'
That makes my app crash cause when I navigate to the: app > build > intermediates > exploded-aar > com.google.android.gms one of the folders (play-services-basement) pull a version 9.4.0 instead 9.0.0 so what I did was to unificate the versions by adding firebase like:
compile 'com.google.firebase:firebase-core:9.0.0'
compile 'com.google.firebase:firebase-messaging:9.0.0'
In theory you can solve this too by pushing the firebase to 9.4.0 instead.
The bottom line is to try to know which things are your dependencies introducing to the app and check "WHO" is introducing the same thing to the app, once you get there try to set a specific version of that duplicated dependency.
Based from this forum, try to change the gradle inside your C:\Program Files\Android\Android Studio\gradle\ to gradle-2.10. Also, it seems unlikely that a program that is designed to run on an Android device doesn't need all of the jars. Try removing some of them.
Check this related SO questions:
TransformException duplicate entry for common.annotations.Beta
Android dependency issue with gms play services
It seems that you have at least one library already bundled with GMS.
None of the dependencies stated in your gradle build file should have it, so the culprit might be a library jar file in your libs dir. So either you have something in your libs dir you shouldn't have put there, or a library that has GMS bundled inside of it.
Did you remember to delete libs/google-play-services.jar?

What are the necessary gradle dependencies for an App Engine Backend with Google Cloud Messaging?

What are the necessary gradle dependencies for an App Engine Backend with Google Cloud Messaging?
Currently, when you add a module like that to your Android Studio project it adds this dependency:
'compile 'com.google.android.gms:play-services:8.4.0'
However, when you run the project you get this error:
Error:Execution failed for task
':app:transformClassesWithDexForDebug'.
com.android.build.api.transform.TransformException: com.android.ide.common.process.ProcessException:
org.gradle.process.internal.ExecException: Process 'command
'/Library/Java/JavaVirtualMachines/jdk1.7.0_79.jdk/Contents/Home/bin/java''
finished with non-zero exit value 2
Someone suggested using this:
defaultConfig {
multiDexEnabled true
}
But that actually didn't work for me.
So it appears that I have to specify only the required libraries for GAE + GCM. So far I have:
compile 'com.google.android.gms:play-services-auth:8.4.0'
compile 'com.google.android.gms:play-services-gcm:8.4.0'
compile 'com.google.android.gms:play-services-base:8.4.0'
full list here. But that didn't work. I got this error:
E/GMPM: GoogleService failed to initialize, status: 10, Missing an
expected resource: 'R.string.google_app_id' for initializing Google
services. Possible causes are missing google-services.json or
com.google.gms.google-services gradle plugin.
So I am at a loss.
Is there some other way around this issue? What is weird is my old GAE + GCM projects work fine importing the whole google play services. Importing those older versions of google play services in my new project does not work however. So I am not sure what is going on.
EDIT: Some more information:
I did some tests.
1) Started new Android Studio project, added new google cloud module 'App Engine Java Endpoints Module'. The auto-generated build.grade (Module: app) looks like this:
dependencies {
compile fileTree(dir: 'libs', include: ['*.jar'])
testCompile 'junit:junit:4.12'
compile 'com.android.support:appcompat-v7:23.1.1'
compile 'com.android.support:design:23.1.1'
compile project(path: ':backend', configuration: 'android-endpoints')
}
Result? Compiles and runs perfectly - no problems!
2) Started new Android Studio project, added new google cloud module 'App Engine Backend with Google Cloud Messaging'. the auto-generated build.grade (Module: app) looks like this:
dependencies {
compile fileTree(dir: 'libs', include: ['*.jar'])
testCompile 'junit:junit:4.12'
compile 'com.android.support:appcompat-v7:23.1.1'
compile 'com.android.support:design:23.1.1'
compile 'com.google.android.gms:play-services:8.4.0'
compile project(path: ':backend', configuration: 'android-endpoints')
}
Result? Same crappy error I have been getting!
So it looks like the line 'compile 'com.google.android.gms:play-services:8.4.0'' is the problem. I replaced it with
'compile 'com.google.android.gms:play-services-gcm:8.4.0''
since in theory that is all I need for google cloud messaging. When I run it I get this:
12-30 14:14:16.482 10573-10573/com.myapp.myapp
E/GMPM: GoogleService failed to initialize, status: 10, Missing an
expected resource: 'R.string.google_app_id' for initializing Google
services. Possible causes are missing google-services.json or
com.google.gms.google-services gradle plugin. 12-30 14:14:16.482
10573-10573/com.myapp.myapp E/GMPM: Scheduler not
set. Not logging error/warn. 12-30 14:14:16.502
10573-10623/com.myapp.myapp E/GMPM: Uploading is
not possible. App measurement disabled
So it looks like I am missing this google-services.json file or something. I don't get what happened with Android Studio because several months ago I made a GCM enabled app the same way and that one compiles no problem. The gradle.build file of that app looks like this:
dependencies {
compile fileTree(include: ['*.jar'], dir: 'libs')
compile project(path: ':gcm-backend', configuration: 'android-endpoints')
compile 'com.android.support:appcompat-v7:22.2.0'
compile 'com.ganyo:gcm-server:1.0.2'
compile 'com.google.android.gms:play-services:7.5.0'
compile 'com.android.support:support-v4:22.2.0'
}
So it looks like Android Studio stopped adding the 'compile 'com.ganyo:gcm-server:1.0.2'' dependency.
So I ran a project with
'compile 'com.ganyo:gcm-server:1.0.2'
'compile 'com.google.android.gms:play-services:8.4.0'
Result? Same Execution failed error.
Ok so let's try the old play-services library in my new project:
'compile 'com.ganyo:gcm-server:1.0.2'
'compile 'com.google.android.gms:play-services:7.5.0'
Result? Same Execution failed error.
I just don't get why this isn't working out of the box like it used to...
So, this should be considered an issue with Android Studio since simply adding a module 'App Engine Backend with Google Cloud Messaging' will break the build every time on even the simplest of apps, due to the full Google Play Services dependency 'com.google.android.gms:play-services:8.4.0' being large enough to exceed the 65K DEX method limit on its own. This problem is actually documented in 'Setting Up Google Play Services'.
The solution is, as you had discovered, to manually edit your build.gradle and add only the import for GCM 'com.google.android.gms:play-services-gcm:8.4.0'. The requirement for 'google-services.json' to be added manually is normal though, since you need to generate it for your project on developers.google.com. Adding 'multiDexEnabled true' isn't a good solution, as it increases your APK size needlessly, and you still end up with duplicate dependencies.
I've created an entry on the Android issue tracker to fix the dependencies for the App Engine GCM backend module in Android Studio. Feel free to star this issue for visibility and updates.
Preliminary tests show that this works so far.
I took at a look at the google GCM sample project here: https://github.com/googlesamples/google-services/tree/master/android/gcm
And edited my gradle files. Here is what they look like now:
APP:
apply plugin: 'com.android.application'
android {
compileSdkVersion 23
buildToolsVersion "23.0.2"
defaultConfig {
applicationId "com.me.myapp"
minSdkVersion 13
targetSdkVersion 23
versionCode 1
versionName "1.0"
}
buildTypes {
release {
minifyEnabled false
proguardFiles getDefaultProguardFile('proguard-android.txt'), 'proguard-rules.pro'
}
}
}
dependencies {
compile fileTree(dir: 'libs', include: ['*.jar'])
compile 'com.google.android.gms:play-services-gcm:8.4.0'
testCompile 'junit:junit:4.12'
compile project(path: ':backend', configuration: 'android-endpoints')
compile 'com.android.support:appcompat-v7:23.1.1'
compile 'com.android.support:design:23.1.1'
}
apply plugin: 'com.google.gms.google-services'
PROJECT:
// Top-level build file where you can add configuration options common to all sub-projects/modules.
buildscript {
repositories {
jcenter()
}
dependencies {
classpath 'com.android.tools.build:gradle:1.5.0'
classpath 'com.google.gms:google-services:2.0.0-alpha3'
// NOTE: Do not place your application dependencies here; they belong
// in the individual module build.gradle files
}
}
allprojects {
repositories {
jcenter()
}
}
task clean(type: Delete) {
delete rootProject.buildDir
}
And also I followed this guide (see step 2) to generate a google-services.json file which I dropped into the app/ directory.
Now the app compiles and works (so far at least).
I'm really angry this doesn't work out of the box with the auto generated gradle files and that I have to hunt them down in some sample app. It didn't used to be this way just a few months ago. It worked as soon as you added the GCM module.
If anyone else has any tips/suggestions for future projects please let me know. =D
If you do get to the stage where you need to run with MultiDex enabled, there are three steps you need to do:
Enable it in your defaultConfig in Gradle as you already tried:
defaultConfig {
...
minSdkVersion 14
targetSdkVersion 21
...
// Enabling multidex support.
multiDexEnabled true
}
Include it in your dependencies:
dependencies {
compile 'com.android.support:multidex:1.0.0'
}
Add it to your manifest:
<?xml version="1.0" encoding="utf-8"?>
<manifest xmlns:android="http://schemas.android.com/apk/res/android"
package="com.example.android.multidex.myapplication">
<application
...
android:name="android.support.multidex.MultiDexApplication">
...
</application>
</manifest>
https://developer.android.com/intl/es/tools/building/multidex.html#about
But always have a good look at the dependencies you already have as it's usually not needed.

Java finished with non-zero exit value 2 - Android Gradle

I'm getting this error executing my Android app (I cleaned it and then built it, but the error is still present)
Sync: OK
Make Project: OK
Clean: OK
Run: Error
Error:Execution failed for task ':app:dexDebug' .com.android.ide.common.process.ProcessException: org.gradle.process.internal.ExecException: Process 'command 'C:\Program Files\Java\jdk1.7.0_25\bin\java.exe'' finished with non-zero exit value 2
My gradle file:
apply plugin: 'com.android.application'
android {
compileSdkVersion 21
buildToolsVersion "21.1.2"
defaultConfig {
applicationId "com.rzr.rzevallosr.miappdepruebas"
minSdkVersion 19
targetSdkVersion 21
versionCode 1
versionName "1.0"
}
buildTypes {
release {
minifyEnabled false
proguardFiles getDefaultProguardFile('proguard-android.txt'), 'proguard-rules.pro'
}
}
productFlavors {
}
repositories {
mavenCentral()
flatDir {
dirs 'libs'
}
}
}
dependencies {
compile fileTree(dir: 'libs', include: ['*.jar'])
// This library handles authentication and authorization
compile 'com.spotify.sdk:spotify-auth:1.0.0-beta9#aar'
// This library handles music playback
compile 'com.spotify.sdk:spotify-player:1.0.0-beta9#aar'
compile 'com.android.support:appcompat-v7:21.0.3'
compile 'com.android.support:recyclerview-v7:21.0.+'
compile 'com.squareup.retrofit:retrofit:1.9.0'
compile 'com.squareup.okhttp:okhttp-urlconnection:2.2.0'
compile 'com.squareup.okhttp:okhttp:2.2.0'
compile files('libs/spotify-web-api-android-master-0.1.0.jar')
compile files('libs/okio-1.3.0.jar')
}
EDIT: I didn't see "compile fileTree(dir: 'libs', include: ['*.jar'])" it was compiling twice my libraries, so i just comment:
//compile 'com.squareup.retrofit:retrofit:1.9.0'
//compile 'com.squareup.okhttp:okhttp-urlconnection:2.2.0'
//compile 'com.squareup.okhttp:okhttp:2.2.0'
//compile files('libs/spotify-web-api-android-master-0.1.0.jar')
//compile files('libs/okio-1.3.0.jar')
and it works fine.
This issue is quite possibly due to exceeding the 65K methods dex limit imposed by Android. This problem can be solved either by cleaning the project, and removing some unused libraries and methods from dependencies in build.gradle, OR by adding multidex support.
So, If you have to keep libraries and methods, then you can enable multi dex support by declaring it in the gradle config.
defaultConfig {
// Enabling multidex support.
multiDexEnabled true
}
You can read more about multidex support and developing apps with more than 65K methods here.
For me the problem was, i had put a unnecessary complie library code in build.gradle
dependencies {
compile 'com.google.android.gms:play-services:7.5.0'
}
which was causing over 65k methods, so removed it,gradle sync, cleaned project, and then ran again and then this error stopped.
I needed just maps and gcm so i put these lines and synced project
compile 'com.google.android.gms:play-services-gcm:7.5.0'
compile 'com.google.android.gms:play-services-location:7.5.0'
Hi people i again encountered this problem and this time it was because of changing build tools version and it really required me to enable multidex..so i added these my app's build.gradle file..
defaultConfig {
applicationId "com.am.android"
minSdkVersion 13
targetSdkVersion 23
// Enabling multidex support.
multiDexEnabled true
}
dexOptions {
incremental true
javaMaxHeapSize "2048M"
jumboMode = true
}
dependencies {
compile fileTree(include: ['*.jar'], dir: 'libs')
compile 'com.android.support:multidex:1.0.1'
}
And create a class that extends Application class and include this method inside the class..
#Override
protected void attachBaseContext(Context base) {
super.attachBaseContext(base);
MultiDex.install(this);
}
also include in OnCreate method too
#Override
public void onCreate() {
MultiDex.install(this);
super.onCreate();
}
Just in case if someone still struggling with this and have no clue why is this happening and how to fix. In fact this error
Error:Execution failed for task ':app:dexDebug'. > com.android.ide.common.process.ProcessException: org.gradle.process.internal.ExecException: Process 'command 'C:\Program Files\Java\jdkx.x.x_xx\bin\java.exe'' finished with non-zero exit value 2
can have many reasons to happen but certainly not something related to your JDK version so don't wast your time in wrong direction.
These are two main reasons for this to happen
You have same library or jar file included several places and some of them conflicting with each other.
You are about to or already exceeded 65k method limit
First case can be fixed as follows:
Find out which dependencies you have included multiple times. In order to do this run following command in android studio terminal
gradlew -q dependencies yourProjectName_usually_app:dependencies --configuration compile
this will return all the dependencies but jar files that you include from lib folder
try to get rid of duplication marked with asterisk (*), this is not always possible but in some cases you still can do it, after this try to exclude modules that are included many times, you can do it like this
compile ('com.facebook.android:facebook-android-sdk:4.0.1'){
exclude module: 'support-v4'
}
For the second case when you exceeding method limit suggestion is to try to minimize it by removing included libraries (note sounds like first solution) if no way to do it add multiDexEnabled true to your defaultConfig
defaultConfig {
...
...
multiDexEnabled true
}
this increases method limit but it is not the best thing to do because of possible performance issues
IMPORTANT adding only multiDexEnabled true to defaultConfig is not enough in fact on all devices running android <5 Lollipop it will result in unexpected behavior and NoClassDefFoundError. how to solve it is described here
I didn't know (by then) that "compile fileTree(dir: 'libs', include: ['*.jar'])" compile all that has jar extension on libs folder, so i just comment (or delete) this lines:
//compile 'com.squareup.retrofit:retrofit:1.9.0'
//compile 'com.squareup.okhttp:okhttp-urlconnection:2.2.0'
//compile 'com.squareup.okhttp:okhttp:2.2.0'
//compile files('libs/spotify-web-api-android-master-0.1.0.jar')
//compile files('libs/okio-1.3.0.jar')
and it works fine. Thanks anyway! My bad.
I had the same issue and I fixed removing the library that were unnecessary
compile fileTree(dir: 'libs', include: ['*.jar'])
I removed that library and I could run the project without any problem.
Mine got solved by enabling multiDex for debug builds.
defaultConfig {
multiDexEnabled true
}
I Reject Embedded JDK ( in 32bit ) because embedded JDK is 64bit
Right click your Project -> Open Module Setting -> SDK Location -> Uncheck Use embedded JDk then set your JDK Path, eg in Ubuntu /usr/lib/jvm/java-8-openjdk-i386
Possible problem: You have exceeded dex 65k methods limit, may be you added some library or several methods before problem occurred?
If You have already updated your SDK and You also using google-play-services then you need to take care of the dependency because there are some kind of conflics with :
Follow the below : compile 'com.google.android.gms:play-services:+' Replace by compile 'com.google.android.gms:play-services:6.5.87'
Note: Here '6.5.87' is the google-play-service version. I hope it will help..
I think it's conflicts of .jar file in your project.
I have removed android-support-v4.jar from libs folder and its working !!!
if your project gives error, check in your build.gradle file
dependencies {
}
In my case, the problem was that the new library (gradle dependency) that I had added was relying on some other dependencies and two of those underlying dependencies were conflicting/clashing with some dependencies of other libraries/dependencies in my build script. Specifically, I added Apache Commons Validator (for email validation), and two of its dependencies (Apache Commons Logging and Apache Commons Collections) were conflicting with those used by Robolectric (because different versions of same libraries were present in my build path). So I excluded those conflicting versions of dependencies (modules) when adding the new dependency (the Validator):
compile ('commons-validator:commons-validator:1.4.1') {
exclude module: 'commons-logging'
exclude module: 'commons-collections'
}
You can see the dependencies of your gradle module(s) (you might have only one module in your project) using the following gradle command (I use the gradle wrapper that gets created for you if you have created your project in Android Studio/Intellij Idea). Run this command in your project's root directory:
./gradlew :YOUR-MODULE-NAME:dependencies
After adding those exclude directives and retrying to run, I got a duplicate file error for NOTICE.txtthat is used by some apache commons libraries like Logging and Collections. I had to exclude that text file when packaging. In my build.gradle, I added:
packagingOptions {
exclude 'META-INF/NOTICE'
exclude 'META-INF/notice.txt'
exclude 'META-INF/NOTICE.txt'
}
It turned out that the new library (the Validator) can work with slightly older versions of its dependencies/modules (which are already imported into my build path by another library (Robolectric)). This was the case with this specific library, but other libraries might be using the latest API of the underlying dependencies (in which case you have to try to see if the other libraries that rely on the conflicting module/dependency are able to work with the newer version (by excluding the older version of the module/dependecy under those libraries's entries)).
In my case, I got this error when there are 2 or more libraries conflict (same library but different versions). Check your app build.gradle in dependencies block.
There are two alternatives that'll work for sure:
Clean your project and then build.
If the above method didn't worked, try the next.
Add the following to build.gradle file at app level
defaultConfig {
multiDexEnabled true
}
Updating my Java SDK to the latest version 1.7.0_79 and updating the SDK Location under Project Structure solved the problem for me.
My problem was that apart from having
com.android.build.api.transform.TransformException:
com.android.ide.common.process.ProcessException:
org.gradle.process.internal.ExecException: Process 'command
'/Library/Java/JavaVirtualMachines/jdk1.X.X_XX.jdk/Contents/Home/bin/java''
finished with non-zero exit value 2
I had this trace as well:
Uncaught translation error: java.lang.IllegalArgumentException:
already added: Lcom/mypackage/ClassX;
The problem was that I was adding the same class in two differents libraries. Removing the class/jar file from one of the libraries, the project run properly
For me i was adding the whole playstore dependencies
compile 'com.google.android.gms:play-services:8.4.0'
But i needed google map only , so i made it more specific and the error was resolved.
compile 'com.google.android.gms:play-services-maps:8.4.0'
in my case problem was build tools version which was 23.0.0 rc3 and i changed to 22.0.1 and my problem fixed.
You may be using a low quality cable/defected cable to connect your device to the PC, I replaced the cable and it worked for me.
This error is because of using more number of libraries.in my case 'compile 'com.google.android.gms:play-services-9.4.0' caused this error.To avoid this error use necessary libraries.for example if you want to use Maps in your app.Then use
compile 'com.google.android.gms:play-services-maps:9.4.0'.while adding google play services dependency specify the needed libraries only.by default it includes all the libraries.
In Your gradle.build file, Use this
"compile fileTree(dir: 'libs', include: ['*.jar'])"
And it works fine.
If you want to see what exactly is causing the error, try building your project via gradle terminal, like this ./gradlew assembleDebug --stacktrace --debug . I've seen the following error in my case com.android.dex.DexIndexOverflowException: method ID not in [0, 0xffff]: 65536
This happened when I was trying to entegrate Google Maps to my project. To fix it, I simply checked libraries I was including
compile 'com.google.android.gms:play-services:9.8.0'
I simply changed it to
compile 'com.google.android.gms:play-services-maps:9.8.0'
and problem was gone
I had the same error after converting my project to Kotlin. My problem was that my jre location was changed to an invalid path during the process (I wonder why this could happen... made me waste time). Fixed it by doing this:
File > Project Structure > SDK Location
Unchecked the Use embedded JDK option, which was pointing to an old JDK installation, and selected the correct one:
/home/my_user/jdk1.8.0_101
After changing this, the error disappeared
WORKED FOR ME :)
i upgraded the java to the latest version 8 previously it was 7 and then go to OPEN MODULE SETTING right clicking on project and changed the jdk path to /usr/lib/jvm/java-8-oracle the new java 8 installed. And restart the studio
check in /usr/lib/jvm for java 8 folder name
I am using ubuntu

Android Studio - UNEXPECTED TOP-LEVEL EXCEPTION:

I have built a new project in Android Studio using the new project templates provided as part of the tool. All of the code has been generated by Studio I have not made any amendments yet.
I am attempting to run the code but the app fails with the following errors, not sure what the problem is so any help appreciated.
UNEXPECTED TOP-LEVEL EXCEPTION:
com.android.dex.DexException: Multiple dex files define Landroid/support/v7/app/ActionBar$Callback;
at com.android.dx.merge.DexMerger.readSortableTypes(DexMerger.java:594)
at com.android.dx.merge.DexMerger.getSortedTypes(DexMerger.java:552)
at com.android.dx.merge.DexMerger.mergeClassDefs(DexMerger.java:533)
at com.android.dx.merge.DexMerger.mergeDexes(DexMerger.java:170)
at com.android.dx.merge.DexMerger.merge(DexMerger.java:188)
at com.android.dx.command.dexer.Main.mergeLibraryDexBuffers(Main.java:439)
at com.android.dx.command.dexer.Main.runMonoDex(Main.java:287)
at com.android.dx.command.dexer.Main.run(Main.java:230)
at com.android.dx.command.dexer.Main.main(Main.java:199)
at com.android.dx.command.Main.main(Main.java:103)
FAILED
FAILURE: Build failed with an exception.
* What went wrong:
Execution failed for task ':app:dexDebug'.
> com.android.ide.common.internal.LoggedErrorException: Failed to run command:
C:\Users\RichardKavanagh\AppData\Local\Android\android-sdk\build-tools\19.0.1\dx.bat --dex --output D:\Android\Projects\MyHealthRecord\app\build\libs\app-debug.dex D:\Android\Projects\MyHealthRecord\app\build\classes\debug D:\Android\Projects\MyHealthRecord\app\build\dependency-cache\debug D:\Android\Projects\MyHealthRecord\app\build\pre-dexed\debug\android-support-v7-appcompat-5a78dab7e2789bbe64f4bc80d106ca75c04dcf6f.jar D:\Android\Projects\MyHealthRecord\app\build\pre-dexed\debug\classes-f9b947272e9f33ba50355b52d82755584f9c0c58.jar D:\Android\Projects\MyHealthRecord\app\build\pre-dexed\debug\support-v4-19.0.0-31a2c13df80d37d62ca50fec3bde6da0ca706223.jar
Error Code:
2
Output:
UNEXPECTED TOP-LEVEL EXCEPTION:
com.android.dex.DexException: Multiple dex files define Landroid/support/v7/app/ActionBar$Callback;
at com.android.dx.merge.DexMerger.readSortableTypes(DexMerger.java:594)
at com.android.dx.merge.DexMerger.getSortedTypes(DexMerger.java:552)
at com.android.dx.merge.DexMerger.mergeClassDefs(DexMerger.java:533)
at com.android.dx.merge.DexMerger.mergeDexes(DexMerger.java:170)
at com.android.dx.merge.DexMerger.merge(DexMerger.java:188)
at com.android.dx.command.dexer.Main.mergeLibraryDexBuffers(Main.java:439)
at com.android.dx.command.dexer.Main.runMonoDex(Main.java:287)
at com.android.dx.command.dexer.Main.run(Main.java:230)
at com.android.dx.command.dexer.Main.main(Main.java:199)
at com.android.dx.command.Main.main(Main.java:103)
* Try:
Run with --stacktrace option to get the stack trace. Run with --info or --debug option to get more log output.
BUILD FAILED
Total time: 12.948 secs
Like everyone else said here, the support library (com.android.support) is being included more than once in your project. Try adding this in your build.gradle at the root level and it should exclude the support library from being exported via other project dependencies.
configurations {
all*.exclude group: 'com.android.support', module: 'support-v4'
}
If you have more then one support libs included in the dependencies like this, you may want to remove one of them:
dependencies {
compile 'com.android.support:support-v4:19.1.+'
compile fileTree(dir: 'libs', include: ['*.jar'])
}
This gets conflicted if you have the support jar in your libs folder.
If you have the support jar in your project libs folder and you have the module dependency added to compile 'com.android.support:support-v4:13.0.+' the UNEXPECTED_TOPLEVEL_DEPENDANCY exception will be thrown.
Because you may include two same libs in your project.
check your build.gradle file.
dependencies {
compile 'com.android.support:appcompat-v7:+'
compile files('libs/android-support-v4.jar')
}
if your file includes compile 'com.android.support:appcompat-v7:+' and compile files('libs/android-support-v4.jar'), it will have this problems.
delete this sentence: compile files('libs/android-support-v4.jar')
That's how I fix this problem.
The error occurs when you have the same library/directory included more than once in your build.gradle's dependencies. Ok, let’s say you have an App structure that looks like this:
So you have the main “app” and then you have a bunch of sub-apps/modules/libraries. The libraries are: 1) gene_test_library, 2) genes_nine_old_androids_library, & 3) swipe_list_view_library.
My name is Gene, so that’s why there are all these “gene” libraries.
Inside the build.gradle for “app”, I have:
dependencies {
compile fileTree(include: ['*.jar'], dir: 'libs')
compile 'com.android.support:appcompat-v7:21.0.0'
compile project(':libraries:gene_test_library')
//compile project(':libraries:genes_nine_old_androids_library')
compile project(':libraries:swipe_list_view_library')
}
Inside the build.gradle for gene_test_library, I have nothing:
dependencies {
}
Inside build.gradle for gene_nine_old_androids_library, I have:
dependencies {
compile fileTree(dir: 'libs', include: ['*.jar'])
compile 'com.android.support:appcompat-v7:21.0.0'
}
Inside build.gradle for swipe_list_view_library, I have:
dependencies {
compile 'com.nineoldandroids:library:2.4.0+'
compile fileTree(dir: 'libs', include: ['*.jar'])
compile 'com.android.support:appcompat-v7:21.0.0'
}
This line of code “compile fileTree(dir: 'libs', include: ['*.jar'])” just means “hey, look inside the ‘libs’ folder inside this module for any jar files. I do not have anything in the libs folder of any of the modules so you can ignore that line of code.
So let’s say I uncomment out //compile project(':libraries:genes_nine_old_androids_library')
In the build.gradle for the “app” module. Then I would get the “UNEXPECTED TOP-LEVEL EXCEPTION:” error. Why is that?
Well, writing //compile project(':libraries:genes_nine_old_androids_library') inside the build.gradle for “app”, is the same as taking the build dependencies of “genes_nine_old_androids_library” module and putting it there. So uncommenting the //compile project(':libraries:genes_nine_old_androids_library') statement, the build.gradle for “app” module becomes:
dependencies {
compile fileTree(include: ['*.jar'], dir: 'libs')
compile 'com.android.support:appcompat-v7:21.0.0'
compile project(':libraries:gene_test_library')
***compile fileTree(dir: 'libs', include: ['*.jar'])***
***compile 'com.android.support:appcompat-v7:21.0.0'***
compile project(':libraries:swipe_list_view_library')
}
Notice how now “compile 'com.android.support:appcompat-v7:21.0.0'” shows up 2x. That’s where the error is coming from.
I found 2 reason for this issue:
Sometimes its because of multiple included libraries. For example you add
compile 'com.nineoldandroids:library:2.4.0'
in your gradle and add another library that it also use "nineoldandroids" in it's gradle!
As Android Developer Official website said:
If you have built an Android app and received this error, then congratulations, you have a lot of code!
So, why?
The Dalvik Executable specification limits the total number of methods that can be referenced within a single DEX file to 65,536, including Android framework methods, library methods, and methods in your own code. Getting past this limit requires that you configure your app build process to generate more than one DEX file, known as a multidex configuration.
Then what should you do?
Avoiding the 65K Limit - How?
Review your app's direct and transitive dependencies - Ensure any large library dependency you include in your app is used in a manner that outweighs the amount of code being added to the application. A common anti-pattern is to include a very large library because a few utility methods were useful. Reducing your app code dependencies can often help you avoid the dex reference limit.
Remove unused code with ProGuard - Configure the ProGuard settings for your app to run ProGuard and ensure you have shrinking enabled for release builds. Enabling shrinking ensures you are not shipping unused code with your APKs.
Configuring Your App for Multidex with Gradle - How?
1.Change your Gradle build configuration to enable multidex.
put
multiDexEnabled true
in the defaultConfig, buildType, or productFlavor sections of your Gradle build file.
2.In your manifest add the MultiDexApplication class from the multidex support library to the application element.
<?xml version="1.0" encoding="utf-8"?>
<manifest xmlns:android="http://schemas.android.com/apk/res/android"
package="com.example.android.multidex.myapplication">
<application
...
android:name="android.support.multidex.MultiDexApplication">
...
</application>
</manifest>
Note: If your app uses extends the Application class, you can override the attachBaseContext() method and call MultiDex.install(this) to enable multidex. For more information, see the MultiDexApplication reference documentation.
Also this code may help you:
dexOptions {
javaMaxHeapSize "4g"
}
Put in your gradle(android{ ... } ).
Hi all I had the same issue that was being caused by a duplicate support version 4 file that I had included while trying to get parse integrated. Deleted the extra inclusion from the libs directory and it works fine now!
This happens when a library is getting compiled twice (i.e it is added two time). It can be support library or any other, it doesn't matter.
The common case is that you have added a compile statement of a library which is already in your libs/ directory. All the *.jar files are compiled automatically. Thus, adding a compile statement is causing the error. Removing that statement might fix this issue. If this is not applicable then we already have some awesome answers.
This might be the dumbest answer, but this worked for me :
I removed and added all the libraries on my project manually.(One after the other) And voila, it worked.
Build -> Rebuild project
Note: No library of mine was compiled twice.
Make sure you have downloaded Support Repository to use support library dependency in build.gradle.
If these all are there already installed sync your project with gradle once using the button available.
In my case TOP LEVEL EXCEPTION was throw because of a special char in project path. Just closed the project, changed "á" to "a" and reopened the project. Works!
Suddenly, without any major change in my project, I too got this error.
All the above did not work for me, since I needed both the support libs V4 and V7.
At the end, because 2 hours ago the project compiled with no problems, I simply told Android Studio to REBUILD the project, and the error was gone.
I had similar problem when I tried to build a signed apk for my app.
Strange, it happened only when I wanted to build a release apk, while on debug apk everything worked OK.
Finally, looking on this thread, I checked for support library duplications in build.gradle and removed any duplications but this wasn't enough..
I had to do clean project and only then finally I've got it to work.
I know that the problem was answered, but this could happen again and my solution was a little different from the ones that I found. In my case the solution wasn't related to include two different libraries in my project. See code below:
compileOptions {
sourceCompatibility JavaVersion.VERSION_1_8
targetCompatibility JavaVersion.VERSION_1_8
}
This code was giving that error "Unexpected Top-Level Exception".
I fix the code making the following changes:
compileOptions {
sourceCompatibility JavaVersion.VERSION_1_7
targetCompatibility JavaVersion.VERSION_1_7
}
I solved my problem with adding these in build gradle:
defaultConfig {
multiDexEnabled true
dependencies {
compile 'com.android.support:multidex:1.0.0'
another solution can be removing unnecessary libraries

Categories

Resources